{"text_format":"1","workbook":"xlsx","n_sheets":4,"sheets":["Laudo","Lista","#","Plan1"],"not_rendered":{"charts":0,"images":2,"macros":1,"external_links":1,"defined_names":90,"comments":1,"pivot_tables":0},"unopened":[],"bounds":{"document_bytes":16777216,"sheet_cells":100000,"rows_first":2000,"rows_last":500,"rows_between":2000,"halvings":0,"cell_chars":16384,"cell_head_chars":4096},"cells_cut":0,"cells_raw":0,"read":"whole","date_system":"1900"}

{"sheet":"Laudo","index":0,"n_rows":323,"n_cols":21,"rows_kept":323,"cut":false,"hidden":false,"merged":[[30,0,30,6],[52,15,52,23],[53,15,53,23],[52,0,52,9],[53,0,53,9],[52,10,52,14],[53,10,53,14],[34,11,34,13],[34,7,34,10],[30,14,30,18],[45,0,45,2],[41,19,41,23],[42,0,42,23],[45,9,45,11],[46,12,46,14],[43,0,43,23],[41,0,41,3],[41,4,41,8],[37,9,37,13],[33,14,33,23],[34,14,34,23],[46,9,46,11],[90,16,90,23],[61,0,61,11],[74,0,74,23],[71,7,71,23],[71,0,71,6],[70,0,70,23],[73,8,73,11],[73,12,73,15],[33,7,33,13],[44,0,44,23],[40,4,40,8],[37,0,37,3],[41,14,41,18],[41,9,41,13],[45,3,45,8],[46,3,46,8],[69,0,69,23],[77,0,77,23],[379,5,379,9],[379,10,379,14],[379,15,380,15],[379,16,380,16],[379,17,380,17],[158,0,158,11],[158,12,158,23],[140,12,141,23],[175,0,176,11],[175,12,176,23],[193,0,194,11],[193,12,194,23],[267,0,267,23],[269,1,320,22],[322,0,322,23],[324,1,374,22],[211,0,211,11],[211,12,211,23],[140,0,141,11],[214,1,265,22],[212,0,212,23],[1,4,1,17],[2,3,2,16],[3,3,3,16],[1,18,1,20],[1,21,1,23],[2,18,2,20],[2,21,2,23],[3,18,3,20],[3,21,3,23],[83,0,83,23],[84,0,84,23],[85,0,85,2],[85,3,85,23],[45,12,45,14],[62,1,62,23],[63,1,63,23],[64,1,64,23],[65,1,65,23],[66,1,66,23],[47,19,47,23],[48,19,48,23],[54,0,55,11],[56,12,56,23],[56,0,56,11],[46,19,46,23],[67,0,67,10],[68,0,68,10],[67,11,67,23],[68,11,68,23],[80,0,80,23],[78,1,78,7],[79,1,79,7],[78,9,78,15],[75,0,75,23],[76,0,76,23],[81,0,81,23],[82,0,82,23],[72,0,72,7],[73,2,73,7],[73,0,73,1],[72,8,72,15],[72,16,72,23],[73,16,73,17],[73,18,73,23],[78,17,78,23],[79,17,79,23],[79,9,79,15],[122,12,123,23],[91,0,91,3],[91,4,91,15],[91,16,93,23],[92,0,92,3],[92,4,92,15],[93,0,93,3],[93,4,93,15],[122,0,123,11],[105,0,105,3],[105,4,105,15],[97,0,97,3],[97,4,97,15],[97,16,99,23],[98,0,98,3],[98,4,98,15],[99,0,99,3],[99,4,99,15],[106,0,106,23],[100,0,100,3],[101,0,101,3],[101,4,101,15],[102,0,102,3],[102,4,102,15],[51,0,51,23],[45,19,45,23],[47,12,47,14],[60,0,60,23],[57,0,57,11],[48,15,48,18],[47,0,47,4],[48,0,48,4],[58,0,58,23],[57,12,57,23],[54,12,55,23],[46,0,46,2],[45,15,45,18],[46,15,46,18],[59,0,59,23],[47,5,47,11],[48,5,48,11],[49,0,49,23],[50,0,50,23],[47,15,47,18],[48,12,48,14],[103,0,103,3],[103,4,103,15],[103,16,105,23],[104,0,104,3],[94,0,94,3],[94,4,94,15],[86,0,86,15],[104,4,104,15],[95,0,95,3],[95,4,95,15],[100,4,100,15],[100,16,102,23],[94,16,96,23],[96,0,96,3],[96,4,96,15],[86,16,86,23],[87,0,87,3],[88,0,88,3],[89,0,89,3],[89,4,89,15],[87,4,87,15],[88,4,88,15],[87,16,89,23],[90,0,90,15],[4,3,5,17],[4,18,4,20],[4,21,4,23],[16,18,16,23],[16,0,16,5],[16,12,16,17],[6,0,6,23],[17,18,17,23],[17,0,17,5],[17,12,17,17],[7,0,7,23],[11,0,11,23],[8,0,8,11],[8,12,8,23],[17,6,17,7],[17,8,17,11],[9,0,9,7],[14,6,14,23],[10,0,10,11],[10,12,10,23],[18,0,18,5],[12,12,12,17],[13,12,13,17],[12,6,12,11],[13,6,13,11],[12,18,12,23],[13,18,13,23],[15,6,15,23],[14,0,14,5],[15,0,15,5],[12,0,12,5],[13,0,13,5],[16,6,16,7],[18,6,18,9],[18,10,18,14],[18,15,18,23],[32,7,32,10],[25,8,25,11],[26,8,26,11],[40,9,40,13],[40,0,40,3],[26,12,26,15],[30,7,30,10],[31,11,31,13],[29,7,29,10],[34,0,34,6],[39,4,39,8],[35,0,35,23],[36,0,36,23],[39,19,39,23],[40,19,40,23],[37,14,37,18],[38,14,38,18],[38,9,38,13],[40,14,40,18],[26,4,26,7],[31,19,31,23],[32,19,32,23],[26,0,26,3],[29,0,29,6],[38,0,38,3],[26,16,26,19],[28,0,28,23],[27,0,27,23],[32,4,32,6],[37,19,37,23],[38,19,38,23],[20,0,20,23],[19,15,19,23],[24,14,24,18],[31,14,31,18],[24,19,24,23],[29,19,29,23],[23,8,23,13],[25,20,25,23],[26,20,26,23],[23,0,23,3],[37,4,37,8],[38,4,38,8],[32,11,32,13],[23,19,23,23],[24,4,24,7],[23,14,23,18],[31,7,31,10],[21,0,21,23],[25,16,25,19],[29,14,29,18],[39,9,39,13],[33,0,33,6],[19,6,19,9],[19,10,19,14],[19,0,19,5],[30,19,30,23],[39,0,39,3],[29,11,29,13],[30,11,30,13],[31,0,31,3],[32,0,32,3],[31,4,31,6],[22,0,22,23],[24,0,24,3],[23,4,23,7],[32,14,32,18],[39,14,39,18],[24,8,24,13],[25,12,25,15],[25,0,25,3],[25,4,25,7]]}
[]
[]
[null,null,null,"GOVERNO DO ESTADO DO ESPÍRITO SANTO",null,null,null,null,null,null,null,null,null,null,null,null,null,null,"PROCESSO:"]
[null,null,null,"ÓRGÃO OU ENTIDADE",null,null,null,null,null,null,null,null,null,null,null,null,null,null,"FOLHA:"]
[null,null,null,"Comissão de Servidores para Saneamento Contábil Patrimonial (ou Unidade de Controle Patrimonial) criada pela Portaria ÓRGÃO nº XX/2013",null,null,null,null,null,null,null,null,null,null,null,null,null,null,"RUBRICA:"]
[]
["RELATÓRIO DE AVALIAÇÃO DE BEM IMÓVEL PARA FINS CONTÁBEIS"]
["Relatório de uso RESTRITO elaborado por comissão de servidores do órgão ou entidade detentora de bem imóvel pertencente ao patrimônio estadual, exclusivamente para fins de registro contábil e patrimonial, conforme orientações da Portaria conjunta SEFAZ/SECONT/SEGER nº 001 publicada em 27/09/2013."]
["Nº DE ORDEM:"]
["1 -FINALIDADE CONTÁBIL:"]
[]
["2 - IDENTIFICAÇÃO DO BEM IMÓVEL:"]
["Denominação do Imóvel:",null,null,null,null,null,"Órgão proprietário:",null,null,null,null,null,"Principal órgão ocupante:",null,null,null,null,null,"Principal uso/Finalidade:"]
[]
["Tipo de disponibilização:",null,null,null,null,null,"Endereço (Logradouro, nº, complemento, bairro):"]
[]
["Município",null,null,null,null,null,"Estado",null,"CEP:",null,null,null,"Matrícula",null,null,null,null,null,"Ofício / Comarca"]
[]
["Nº de Inscrição Genérica",null,null,null,null,null,"Data de ingresso:",null,null,null,"Processo de Ingresso:",null,null,null,null,"Tipo de Imóvel:"]
[]
["Conta Contábil:"]
[]
["3 - CARACTERIZAÇÃO DO TERRENO:"]
["Formato",null,null,null,"Cota/Greide",null,null,null,"Inclinação / Topografia",null,null,null,null,null,"Situação",null,null,null,null,"Superficie / Drenagem"]
[]
["Área",null,null,null,"Frente",null,null,null,"Fundos",null,null,null,"Lado direito",null,null,null,"Lado esquerdo",null,null,null,"Fração ideal"]
[]
["4 - CARACTERIZAÇÃO DAS BENFEITORIAS:"]
["4.1 - Unidade:"]
["Tipo de Imóvel",null,null,null,null,null,null,"Posição",null,null,null,"Nº Pavts",null,null,"Sistema Estrutural",null,null,null,null,"Fecham. Paredes"]
[]
["Teto",null,null,null,"Nº Vagas",null,null,"Revest. de Piso",null,null,null,"Esquadrias",null,null,"Padrão Acabamento",null,null,null,null,"Reforma"]
[]
["Condições de Habitabilidade",null,null,null,null,null,null,"Vida útil total prevista (em anos):",null,null,null,null,null,null,"Idade Aparente (em anos):"]
[null,null,null,null,null,null,null,{"$f":"IFERROR(VLOOKUP(A31,Lista!A369:B381,2,0),0)","v":0}]
["Estado de Conservação:"]
[]
["Quadro de Áreas:",null,null,null,"Privativa (m²):",null,null,null,null,"De uso comum (m²):",null,null,null,null,"Não Averbada (m²):",null,null,null,null,"Total (m²):"]
["Unidade:",null,null,null,null,null,null,null,null,null,null,null,null,null,null,null,null,null,null,{"$f":"SUM(E39:S39)","v":0}]
["Estacionamento:",null,null,null,null,null,null,null,null,null,null,null,null,null,null,null,null,null,null,{"$f":"SUM(E40:S40)","v":0}]
["Outros:",null,null,null,null,null,null,null,null,null,null,null,null,null,null,null,null,null,null,0]
["Total",null,null,null,{"$f":"SUM(E39:I41)","v":0},null,null,null,null,{"$f":"SUM(J39:N41)","v":0},null,null,null,null,{"$f":"SUM(O39:S41)","v":0},null,null,null,null,{"$f":"SUM(T39:X41)","v":0}]
["Características Complementares da Edificação: "]
[]
["4.2 - Prédio/Condomínio/Conjunto ao qual pertence a unidade (se não for unidade isolada):"]
["Tipo de Uso",null,null,"Posição",null,null,null,null,null,"Nº Pavts",null,null,"Nº Unidades",null,null,"Nº Elevadores",null,null,null,"Rev. Fachada"]
[]
["Padrão Acabamento",null,null,null,null,"Estado de Conservação",null,null,null,null,null,null,"Idade Estim.",null,null,"Estabil./ Solidez",null,null,null,"Vícios Construtivos"]
[]
["Identificação dos Pavimentos"]
[]
["5 - ESTADO DAS BENFEITORIAS NO MOMENTO DA VISTORIA:"]
["Estado de conservação:",null,null,null,null,null,null,null,null,null,"Idade aparente:",null,null,null,null,"Vida útil remanescente (em meses):"]
[{"$f":"IF(A37=0,\"Não indicado (Seção 4.1)\",A37)","v":"Não indicado (Seção 4.1)"},null,null,null,null,null,null,null,null,null,{"$f":"IF(O35=0,\"Não indicado (Seção 4.1)\",O35)","v":"Não indicado (Seção 4.1)"},null,null,null,null,{"$f":"(H35-O35)*12","v":0}]
["5.1 - Valor Contábil da Benfeitorias antes da Avaliação (R$):",null,null,null,null,null,null,null,null,null,null,null,"5.2 - Depreciação Acumulada das Benfeitorias até a data desta Avaliação (R$):"]
[]
[]
["5.3 - Valor Contábil do Terreno antes da Avaliação (R$)"]
["6 - RELATO DA VISTORIA:"]
[]
["7 - MÉTODO(S) E PROCEDIMENTO(S) UTILIZADO(S):"]
["7.1 -Fundamentação dos valores determinados:"]
[null,"Referência à laudo de avaliação do bem imóvel"]
[null,"Referência a valores do bem contidos em documentos oficiais (Parecer técnico, escritura/certidão de ônus, carnê de IPTU, etc.)"]
[null,"Custo de execução das benfeitorias obtido em planilha orçamentária de execução de obra"]
[null,"Estimativa de custo de reedição de benfeitorias pelo CUB"]
[null,"Valor do terreno obtido pela média do valro de 05 (cinco) dados similares ao bem avaliado"]
["7.2 - Valor do terreno (R$):",null,null,null,null,null,null,null,null,null,null,"7.3 - Valor das benfeitorias depreciáveis (R$):"]
[]
[]
["8 - VALOR TOTAL: (arredondar dentro do limite de ±1% , conforme item 7.7.1 da ABNT NBR 14653-1:2001)"]
[{"$f":"A69+L69","v":0},null,null,null,null,null,null,{"$f":"IF(S14=\"Locação\",CONCATENATE(\"(\",'#'!P4,\" mensais)\"),CONCATENATE(\"(\",'#'!P4,\")\"))","v":"()"}]
["8.1 - Variação no Valor do Terreno:",null,null,null,null,null,null,null,"8.2 Variação no Valor das Benfeitorias:",null,null,null,null,null,null,null,"8.3 - Valor residual das benfeitorias:"]
["(7.2 - 5.3):",null,{"$f":"A69-M58","v":0},null,null,null,null,null,"(7.3 - 5.1 - 5.2):",null,null,null,{"$f":"L69-M57","v":0},null,null,null,"(7.3 - 5.3):",null,{"$f":"L69*0.165","v":0}]
[]
["9 - PRESSUPOSTOS, RESSALVAS E FATORES LIMITANTES:"]
[]
["10 - ANEXOS:"]
["I - ",null,null,null,null,null,null,null,"III -",null,null,null,null,null,null,null,"V - "]
["II - ",null,null,null,null,null,null,null,"IV - ",null,null,null,null,null,null,null,"VI -"]
["11 - RESPONSÁVE(IS):"]
["Identificação da Comissão Responsável"]
[]
["Instrumento de criação da Comissão"]
[]
["Local e data:"]
["MEMBROS:",null,null,null,null,null,null,null,null,null,null,null,null,null,null,null,"Carimbo e Assinatura"]
["NOME:"]
["CARGO:"]
["Nº FUNCIONAL:"]
["Identificação do Conselho de Classe e Número de Registro:"]
["NOME:"]
["CARGO:"]
["Nº FUNCIONAL:"]
["NOME:"]
["CARGO:"]
["Nº FUNCIONAL:"]
["NOME:"]
["CARGO:"]
["Nº FUNCIONAL:"]
["NOME:"]
["CARGO:"]
["Nº FUNCIONAL:"]
["NOME:"]
["CARGO:"]
["Nº FUNCIONAL:"]
["ANEXO I - Levantamento Fotográfico:"]
[]
[]
[]
[]
[]
[]
[]
[]
[]
[]
[]
[]
[]
[]
[]
["FOTO 01: LOGRADOURO COM IMÓVEL AVALIANDO À DIREITA",null,null,null,null,null,null,null,null,null,null,null,"FOTO 02: LOGRADOURO COM IMÓVEL AVALIANDO À ESQUERDA"]
[]
[]
[]
[]
[]
[]
[]
[]
[]
[]
[]
[]
[]
[]
[]
[]
[]
["FOTO 03: DESCRIÇÃO DA FOTO",null,null,null,null,null,null,null,null,null,null,null,"FOTO 04: DESCRIÇÃO DA FOTO"]
[]
[]
[]
[]
[]
[]
[]
[]
[]
[]
[]
[]
[]
[]
[]
[]
[]
["FOTO 05: DESCRIÇÃO DA FOTO",null,null,null,null,null,null,null,null,null,null,null,"FOTO 06: DESCRIÇÃO DA FOTO"]
["ANEXO I - Levantamento Fotográfico (continuação):"]
[]
[]
[]
[]
[]
[]
[]
[]
[]
[]
[]
[]
[]
[]
[]
["FOTO 07: DESCRIÇÃO DA FOTO",null,null,null,null,null,null,null,null,null,null,null,"FOTO 08: DESCRIÇÃO DA FOTO"]
[]
[]
[]
[]
[]
[]
[]
[]
[]
[]
[]
[]
[]
[]
[]
[]
[]
["FOTO 09: DESCRIÇÃO DA FOTO",null,null,null,null,null,null,null,null,null,null,null,"FOTO 10: DESCRIÇÃO DA FOTO"]
[]
[]
[]
[]
[]
[]
{"$rows_left_out":124}
{"sheet":"Lista","index":1,"n_rows":474,"n_cols":4,"rows_kept":474,"cut":false,"hidden":true,"merged":[[368,3,379,3],[368,4,378,4]]}
["1 -INFORMAR FINALIDADE CONTÁBIL"]
["AVALIAÇÃO PARA REGISTRO CONTÁBIL"]
["REAVALIAÇÃO A VALOR JUSTO"]
["REDUÇÃO A VALOR RECUPERÁVEL"]
["AJUSTE INICIAL A VALOR JUSTO"]
["OUTRA FINALIDADE (INFORMAR):"]
[]
["2 - IDENTIFICAÇÃO"]
["Órgão Proprietário:"]
["ADERES"]
["APE"]
["ARSI"]
["ASPE"]
["CBMES"]
["CEASA"]
["CETURB-GV"]
["CM"]
["CREFES"]
["CV"]
["DER-ES"]
["DETRAN"]
["SCV"]
["DIO"]
["DPES"]
["DSPM"]
["ESESP"]
["FAMES"]
["FAPES"]
["IASES"]
["IDAF"]
["IDURB"]
["IEMA"]
["IJSN"]
["INCAPER"]
["IOPES"]
["IPAJM"]
["IPEM"]
["JUCEES"]
["MPES"]
["PCES"]
["PGE"]
["PMES"]
["PROCON"]
["PRODEST"]
["RTV-ES"]
["DPEES"]
["SECTTI"]
["SEAG"]
["SEAMA"]
["SEASTDH"]
["SECOM"]
["SECONT"]
["SECT"]
["SEPLOG"]
["SECULT"]
["SEDES"]
["SEDU"]
["SEDURB"]
["SEFAZ"]
["SEG"]
["SEGER"]
["SEJUS"]
["SEP"]
["SESA"]
["SESP"]
["SESPORT"]
["SETOP"]
["SETUR"]
["SRSV"]
["SUPPIN"]
["VG"]
["Principal Uso:"]
["Administrativo"]
["Arquivo Público"]
["Batalhão"]
["Biblioteca"]
["Campo de Futebol"]
["Centro Social"]
["Corpo de Bombeiros"]
["Creche"]
["Delegacia"]
["Depósito"]
["Escola Pública Estadual"]
["Estádio"]
["Fazenda"]
["Fórum"]
["Galpão"]
["Garagem"]
["Ginásio"]
["Hospital Público"]
["Mercado"]
["Ministério Público"]
["Museu"]
["Órgãos Públicos"]
["Palácio"]
["Parque"]
["Posto Fiscal"]
["Praça"]
["Presídio"]
["Quartel"]
["Reserva Florestal"]
["Teatro"]
["Terminal Rodoviário e Aquaviário"]
["Tribunal de Justiça - TJ"]
["Unidade de Saúde"]
["Via Pública"]
["Tipo de disponibilização:"]
["Cessão de Uso"]
["Concessão de Uso"]
["Próprio"]
["Locado"]
["Município:"]
["AFONSO CLÁUDIO"]
["ÁGUA DOCE DO NORTE"]
["ÁGUIA BRANCA"]
["ALEGRE"]
["ALFREDO CHAVES"]
["ALTO RIO NOVO"]
["ANCHIETA"]
["APIACÁ"]
["ARACRUZ"]
["ATÍLIO VIVÁCQUA"]
["BAIXO GUANDU"]
["BARRA DE SÃO FRANCISCO"]
["BOA ESPERANÇA"]
["BOM JESUS DO NORTE"]
["BREJETUBA"]
["CACHOEIRO DE ITAPEMIRIM"]
["CARIACICA"]
["CASTELO"]
["COLATINA"]
["CONCEIÇÃO DA BARRA"]
["CONCEIÇÃO DO CASTELO"]
["DIVINO DE SÃO LOURENÇO"]
["DOMINGOS MARTINS"]
["DORES DO RIO PRETO"]
["ECOPORANGA"]
["FUNDÃO"]
["GOVERNADOR LINDENBERG"]
["GUAÇUÍ"]
["GUARAPARI"]
["IBATIBA"]
["IBIRAÇU"]
["IBITIRAMA"]
["ICONHA"]
["IRUPI"]
["ITAGUAÇU"]
["ITAPEMIRIM"]
["ITARANA"]
["IÚNA"]
["JAGUARÉ"]
["JERÔNIMO MONTEIRO"]
["JOÃO NEIVA"]
["LARANJA DA TERRA"]
["LINHARES"]
["MANTENÓPOLIS"]
["MARATAÍZES"]
["MARECHAL FLORIANO"]
["MARILÂNDIA"]
["MIMOSO DO SUL"]
["MONTANHA"]
["MUCURICI"]
["MUNIZ FREIRE"]
["MUQUI"]
["NOVA VENÉCIA"]
["PANCAS"]
["PEDRO CANÁRIO"]
["PINHEIROS"]
["PIÚMA"]
["PONTO BELO"]
["PRESIDENTE KENNEDY"]
["RIO BANANAL"]
["RIO NOVO DO SUL"]
["SANTA LEOPOLDINA"]
["SANTA MARIA DE JETIBÁ"]
["SANTA TERESA"]
["SÃO DOMINGOS DO NORTE"]
["SÃO GABRIEL DA PALHA"]
["SÃO JOSÉ DO CALÇADO"]
["SÃO MATEUS"]
["SÃO ROQUE DO CANAÃ"]
["SERRA"]
["SOORETAMA"]
["VARGEM ALTA"]
["VENDA NOVA DO IMIGRANTE"]
["VIANA"]
["VILA PAVÃO"]
["VILA VALÉRIO"]
["VILA VELHA"]
["VITÓRIA"]
[]
["Tipo de Imóvel"]
["Edificação"]
["Ilhas"]
["Terras Devolutas"]
["Terras Devolutas - Rural"]
["Terras Devolutas - Urbana"]
["Terreno Acrescido de Marinha"]
["Terreno com Edificação"]
["Terreno de Marinha"]
{"$rows_left_out":275}
{"sheet":"#","index":2,"n_rows":4,"n_cols":16,"rows_kept":4,"cut":false,"hidden":true,"merged":[[1,3,1,7],[1,8,1,12],[1,13,2,13],[1,14,2,14],[1,15,2,15]]}
[]
[null,null,null,"Decomposição",null,null,null,null,"Parte Inteira",null,null,null,null,"Moeda","Centavos","Valor por Extenso"]
[null,null,"Valor a converter","trilhões","bilhões","milhões","milhares","unidades","trilhões","bilhões","milhões","milhares","unidades"]
[null,null,{"$f":"Laudo!A72","v":0},{"$f":"TRUNC(($C4-((10^{15,12,9,6,3})*INT($C4/(10^{15,12,9,6,3}))))/10^{12,9,6,3,0})","v":0},0,0,0,0,{"$f":"IF($C4<10^15,\"\",IF(OR(D4=1,AND(D4>=100,MOD(D4,100)=0)),IF(TRUNC(($C4-(10^12*INT($C4/(10^12)))))=0,_e_,_sp_),IF(D4<100,\"\",_sp_)))&IF(D4=1,INDEX(Sng,1,5),IF(D4<100,\"\",IF(D4=100,OCem,INDEX(Cem,1,TRUNC(D4/100)))))&IF(MOD(D4,100)=0,\"\",IF(D4=1,\"\",IF(OR(MOD(D4,100)>=20,MOD(D4,100)=10),IF(OR(D4>100,AND($C4>10^15,TRUNC(($C4-(10^12*INT($C4/(10^12)))))=0)),_e_,IF($C4>10^15,_sp_,\"\")),\"\")))&IF(MOD(D4,100)=0,\"\",IF(D4=1,\"\",IF(OR(MOD(D4,100)>=20,MOD(D4,100)=10),INDEX(Dez,1,TRUNC(MOD(D4,100)/10)),\"\")))&IF(MOD(D4,100)=0,\"\",IF(D4=1,\"\",IF(MOD(MOD(D4,100),10)<>0,IF(OR(D4>20,AND($C4>10^15,TRUNC(($C4-(10^12*INT($C4/(10^12)))))=0)),_e_,IF($C4>10^15,_sp_,\"\")),\"\")))&IF(D4=0,\"\",IF(D4=1,\"\",IF(MOD(MOD(D4,100),10)=0,\"\",IF(MOD(D4,100)<20,INDEX(Sml,1,MOD(D4,100)),INDEX(Sml,1,MOD(MOD(D4,100),10)))))) & IF(D4<=1,\"\",INDEX(Plu,1,5))","v":""},{"$f":"IF($C4<10^12,\"\",IF(OR(E4=1,AND(E4>=100,MOD(E4,100)=0)),IF(TRUNC(($C4-(10^9*INT($C4/(10^9)))))=0,_e_,_sp_),IF(E4<100,\"\",_sp_)))&IF(E4=1,INDEX(Sng,1,4),IF(E4<100,\"\",IF(E4=100,OCem,INDEX(Cem,1,TRUNC(E4/100)))))&IF(MOD(E4,100)=0,\"\",IF(E4=1,\"\",IF(OR(MOD(E4,100)>=20,MOD(E4,100)=10),IF(OR(E4>100,AND($C4>10^12,TRUNC(($C4-(10^9*INT($C4/(10^9)))))=0)),_e_,IF($C4>10^12,_sp_,\"\")),\"\")))&IF(MOD(E4,100)=0,\"\",IF(E4=1,\"\",IF(OR(MOD(E4,100)>=20,MOD(E4,100)=10),INDEX(Dez,1,TRUNC(MOD(E4,100)/10)),\"\")))&IF(MOD(E4,100)=0,\"\",IF(E4=1,\"\",IF(MOD(MOD(E4,100),10)<>0,IF(OR(E4>20,AND($C4>10^12,TRUNC(($C4-(10^9*INT($C4/(10^9)))))=0)),_e_,IF($C4>10^12,_sp_,\"\")),\"\")))&IF(E4=0,\"\",IF(E4=1,\"\",IF(MOD(MOD(E4,100),10)=0,\"\",IF(MOD(E4,100)<20,INDEX(Sml,1,MOD(E4,100)),INDEX(Sml,1,MOD(MOD(E4,100),10)))))) & IF(E4<=1,\"\",INDEX(Plu,1,4))","v":""},{"$f":"IF($C4<10^9,\"\",IF(OR(F4=1,AND(F4>=100,MOD(F4,100)=0)),IF(TRUNC(($C4-(10^6*INT($C4/(10^6)))))=0,_e_,_sp_),IF(F4<100,\"\",_sp_)))&IF(F4=1,INDEX(Sng,1,3),IF(F4<100,\"\",IF(F4=100,OCem,INDEX(Cem,1,TRUNC(F4/100)))))&IF(MOD(F4,100)=0,\"\",IF(F4=1,\"\",IF(OR(MOD(F4,100)>=20,MOD(F4,100)=10),IF(OR(F4>100,AND($C4>10^9,TRUNC(($C4-(10^6*INT($C4/(10^6)))))=0)),_e_,IF($C4>10^9,_sp_,\"\")),\"\")))&IF(MOD(F4,100)=0,\"\",IF(F4=1,\"\",IF(OR(MOD(F4,100)>=20,MOD(F4,100)=10),INDEX(Dez,1,TRUNC(MOD(F4,100)/10)),\"\")))&IF(MOD(F4,100)=0,\"\",IF(F4=1,\"\",IF(MOD(MOD(F4,100),10)<>0,IF(OR(F4>20,AND($C4>10^9,TRUNC(($C4-(10^6*INT($C4/(10^6)))))=0)),_e_,IF($C4>10^9,_sp_,\"\")),\"\")))&IF(F4=0,\"\",IF(F4=1,\"\",IF(MOD(MOD(F4,100),10)=0,\"\",IF(MOD(F4,100)<20,INDEX(Sml,1,MOD(F4,100)),INDEX(Sml,1,MOD(MOD(F4,100),10)))))) & IF(F4<=1,\"\",INDEX(Plu,1,3))","v":""},{"$f":"IF($C4<10^6,\"\",IF(OR(G4=1,AND(G4>=100,MOD(G4,100)=0)),IF(TRUNC(($C4-(10^3*INT($C4/(10^3)))))=0,_e_,_sp_),IF(G4<100,\"\",_sp_)))&IF(G4=1,INDEX(Sng,1,2),IF(G4<100,\"\",IF(G4=100,OCem,INDEX(Cem,1,TRUNC(G4/100)))))&IF(MOD(G4,100)=0,\"\",IF(G4=1,\"\",IF(OR(MOD(G4,100)>=20,MOD(G4,100)=10),IF(OR(G4>100,AND($C4>10^6,TRUNC(($C4-(10^3*INT($C4/(10^3)))))=0)),_e_,IF($C4>10^6,_sp_,\"\")),\"\")))&IF(MOD(G4,100)=0,\"\",IF(G4=1,\"\",IF(OR(MOD(G4,100)>=20,MOD(G4,100)=10),INDEX(Dez,1,TRUNC(MOD(G4,100)/10)),\"\")))&IF(MOD(G4,100)=0,\"\",IF(G4=1,\"\",IF(MOD(MOD(G4,100),10)<>0,IF(OR(G4>20,AND($C4>10^6,TRUNC(($C4-(10^3*INT($C4/(10^3)))))=0)),_e_,IF($C4>10^6,_sp_,\"\")),\"\")))&IF(G4=0,\"\",IF(G4=1,\"\",IF(MOD(MOD(G4,100),10)=0,\"\",IF(MOD(G4,100)<20,INDEX(Sml,1,MOD(G4,100)),INDEX(Sml,1,MOD(MOD(G4,100),10)))))) & IF(G4<=1,\"\",INDEX(Plu,1,2))","v":""},{"$f":"IF($C4<10^3,\"\",IF(OR(H4=1,AND(H4>=100,MOD(H4,100)=0)),IF(TRUNC(($C4-(10^0*INT($C4/(10^0)))))=0,_e_,_sp_),IF(H4<100,\"\",_sp_)))&IF(H4=1,INDEX(Sng,1,1),IF(H4<100,\"\",IF(H4=100,OCem,INDEX(Cem,1,TRUNC(H4/100)))))&IF(MOD(H4,100)=0,\"\",IF(H4=1,\"\",IF(OR(MOD(H4,100)>=20,MOD(H4,100)=10),IF(OR(H4>100,AND($C4>10^3,TRUNC(($C4-(10^0*INT($C4/(10^0)))))=0)),_e_,IF($C4>10^3,_sp_,\"\")),\"\")))&IF(MOD(H4,100)=0,\"\",IF(H4=1,\"\",IF(OR(MOD(H4,100)>=20,MOD(H4,100)=10),INDEX(Dez,1,TRUNC(MOD(H4,100)/10)),\"\")))&IF(MOD(H4,100)=0,\"\",IF(H4=1,\"\",IF(MOD(MOD(H4,100),10)<>0,IF(OR(H4>20,AND($C4>10^3,TRUNC(($C4-(10^0*INT($C4/(10^0)))))=0)),_e_,IF($C4>10^3,_sp_,\"\")),\"\")))&IF(H4=0,\"\",IF(H4=1,\"\",IF(MOD(MOD(H4,100),10)=0,\"\",IF(MOD(H4,100)<20,INDEX(Sml,1,MOD(H4,100)),INDEX(Sml,1,MOD(MOD(H4,100),10)))))) & IF(H4<=1,\"\",INDEX(Plu,1,1))","v":""},{"$f":"IF($C4<1,\"\",IF(TRUNC($C4)=1,\" real\",IF(AND($C4>=10^6,TRUNC($C4-10^6*INT($C4/10^6))=0),\" de\",\"\") & \" reais\"))","v":""},{"$f":"IF((ROUND($C4-TRUNC($C4),2)*100)=0,\"\",IF($C4>=1,_e_,\"\") & IF((ROUND($C4-TRUNC($C4),2)*100)=1,\"um centavo\",IF((ROUND($C4-TRUNC($C4),2)*100)>=20,INDEX(Dez,1,TRUNC((ROUND($C4-TRUNC($C4),2)*100)/10)) & IF(MOD((ROUND($C4-TRUNC($C4),2)*100),10)<>0,_e_ & INDEX(Sml,1,MOD((ROUND($C4-TRUNC($C4),2)*100),10)),\"\"),INDEX(Sml,1,(ROUND($C4-TRUNC($C4),2)*100))) & \" centavos\"))","v":""},{"$f":"I4&J4&K4&L4&M4&N4&O4","v":""}]

{"sheet":"Plan1","index":3,"n_rows":0,"n_cols":0,"rows_kept":0,"cut":false,"hidden":false,"merged":[]}